{"text_format":"1","workbook":"xlsx","n_sheets":12,"sheets":["DatosBasicos","Departamentos","EntidadesTerritoriales","DAF_BalanceFinancieroVA","DAF_Ley358","DAF_SaldoDeuda","Entidad","Descripción_Glosario","Supuestos Macro Nación","Plan Financiero","Superávit Primario","Capacidad de Endeudamiento"],"not_rendered":{"charts":0,"images":5,"macros":0,"external_links":4,"defined_names":113,"comments":1,"pivot_tables":0},"unopened":[],"bounds":{"document_bytes":16777216,"sheet_cells":100000,"rows_first":2000,"rows_last":500,"rows_between":2000,"halvings":0,"cell_chars":16384,"cell_head_chars":4096},"cells_cut":0,"cells_raw":0,"read":"whole","date_system":"1900"}

{"sheet":"DatosBasicos","index":0,"n_rows":11,"n_cols":4,"rows_kept":11,"cut":false,"hidden":true,"merged":[]}
["AÑO","DEPARTAMENTO","CORTE"]
[2018,"MAGDALENA"]
["SI"]
["NO",null,null,"% DE ICLD CONTRALORIAS DPTALES"]
["E","E",null,1.2E-2]
[1,1,null,0.02]
[2,2,null,2.5000000000000001E-2]
[3,3,null,0.03]
[4,4,null,0.03]
[null,5]
{"$rows_left_out":2}
{"sheet":"Departamentos","index":1,"n_rows":33,"n_cols":2,"rows_kept":33,"cut":false,"hidden":true,"merged":[]}
["NOMBRE_DEPARTAMENTO","CODIGO_DIVIPOLA_DEPARTAMENTO"]
["AMAZONAS",91000]
["ANTIOQUIA",5000]
["ARAUCA",81000]
["ATLANTICO",8000]
["BOLIVAR",13000]
["BOYACA",15000]
["CALDAS",17000]
["CAQUETA",18000]
["CASANARE",85000]
{"$rows_left_out":24}
{"sheet":"EntidadesTerritoriales","index":2,"n_rows":1134,"n_cols":5,"rows_kept":1134,"cut":false,"hidden":true,"merged":[]}
["CONCATENACION","DEPARTAMENTO","CODIGO_DIVIPOLA_ENTIDAD","NOMBRE_ENTIDAD","ESPECIAL"]
[{"$f":"B2&\"-\"&D2","v":"AMAZONAS-DEPARTAMENTO DEL AMAZONAS"},"AMAZONAS",91000,"DEPARTAMENTO DEL AMAZONAS",4]
[{"$f":"B3&\"-\"&D3","v":"AMAZONAS-LETICIA"},"AMAZONAS",91001,"LETICIA",6]
["AMAZONAS-PUERTO NARIÑO","AMAZONAS",91540,"PUERTO NARIÑO",6]
["ANTIOQUIA-ABEJORRAL","ANTIOQUIA",5002,"ABEJORRAL",6]
["ANTIOQUIA-ABRIAQUÍ","ANTIOQUIA",5004,"ABRIAQUÍ",6]
["ANTIOQUIA-ALEJANDRÍA","ANTIOQUIA",5021,"ALEJANDRÍA",6]
["ANTIOQUIA-AMAGÁ","ANTIOQUIA",5030,"AMAGÁ",6]
["ANTIOQUIA-AMALFI","ANTIOQUIA",5031,"AMALFI",6]
["ANTIOQUIA-ANDES","ANTIOQUIA",5034,"ANDES",6]
{"$rows_left_out":1125}
{"sheet":"DAF_BalanceFinancieroVA","index":3,"n_rows":2164,"n_cols":8,"rows_kept":2164,"cut":false,"hidden":true,"merged":[]}
["CONCATENACION","DEPARTAMENTO","CODIGO_DIVIPOLA_ENTIDAD","NOMBRE_ENTIDAD","ORDEN","CODIGO_CONCEPTO_BF","NOMBRE_CONCEPTO_BF","TOTAL"]
[{"$f":"C2&\"-\"&F2","v":"47030-BF_1"},"MAGDALENA",47030,"ALGARROBO",1,"BF_1","INGRESOS TOTALES",13425.611000000001]
["47030-BF_1.1","MAGDALENA",47030,"ALGARROBO",2,"BF_1.1","    INGRESOS CORRIENTES",12032.050999999999]
["47030-BF_1.1.1","MAGDALENA",47030,"ALGARROBO",3,"BF_1.1.1","        TRIBUTARIOS",876.22400000000005]
["47030-BF_1.1.1.1","MAGDALENA",47030,"ALGARROBO",4,"BF_1.1.1.1","             Vehículos Automotores",0.22900000000000001]
["47030-BF_1.1.1.2","MAGDALENA",47030,"ALGARROBO",5,"BF_1.1.1.2","             Impuesto Predial Unificado",81.183000000000007]
["47030-BF_1.1.1.3","MAGDALENA",47030,"ALGARROBO",6,"BF_1.1.1.3","             Impuesto de Industria y Comercio",384.38400000000001]
["47030-BF_1.1.1.8","MAGDALENA",47030,"ALGARROBO",11,"BF_1.1.1.8","             Sobretasa Consumo Gasolina Motor",51.994]
["47030-BF_1.1.1.9","MAGDALENA",47030,"ALGARROBO",12,"BF_1.1.1.9","             Estampillas",52.393000000000001]
["47030-BF_1.1.1.12","MAGDALENA",47030,"ALGARROBO",15,"BF_1.1.1.12","             Otros Ingresos Tributarios",306.041]
{"$rows_left_out":2155}
{"sheet":"DAF_Ley358","index":4,"n_rows":120,"n_cols":7,"rows_kept":120,"cut":false,"hidden":true,"merged":[]}
["CONCATENACION","DEPARTAMENTO","CODIGO_DIVIPOLA_ENTIDAD","NOMBRE_ENTIDAD","CODIGO_INDICADOR","NOMBRE_INDICADOR","TOTAL"]
[{"$f":"C2&\"-\"&E2","v":"47030-CAPEN.1.1"},"MAGDALENA",47030,"ALGARROBO","CAPEN.1.1","1.1 Ingresos corrientes (sin descontar vigencias futuras)",6216.8378140000004]
["47030-CAPEN.2","MAGDALENA",47030,"ALGARROBO","CAPEN.2","2. Gastos de funcionamiento",2200.6347740000001]
["47030-CAPEN.4.1.1","MAGDALENA",47030,"ALGARROBO","CAPEN.4.1.1","4.1.1 Saldo de la deuda",850.247615]
["47030-CAPEN.4.2.1","MAGDALENA",47030,"ALGARROBO","CAPEN.4.2.1","4.2.1 Amortizaciones de la deuda",132.50000399999999]
["47030-CAPEN.5.1","MAGDALENA",47030,"ALGARROBO","CAPEN.5.1","5.1 Intereses de la deuda",83.056566000000004]
["47053-CAPEN.1.1","MAGDALENA",47053,"ARACATACA","CAPEN.1.1","1.1 Ingresos corrientes (sin descontar vigencias futuras)",9325.7784630000006]
["47053-CAPEN.1.2","MAGDALENA",47053,"ARACATACA","CAPEN.1.2","1.2 Vigencias futuras",387.08600000000001]
["47053-CAPEN.2","MAGDALENA",47053,"ARACATACA","CAPEN.2","2. Gastos de funcionamiento",3455.4056110000001]
["47058-CAPEN.1.1","MAGDALENA",47058,"ARIGUANÍ","CAPEN.1.1","1.1 Ingresos corrientes (sin descontar vigencias futuras)",7600.7925969999997]
{"$rows_left_out":111}
{"sheet":"DAF_SaldoDeuda","index":5,"n_rows":681,"n_cols":4,"rows_kept":681,"cut":false,"hidden":true,"merged":[]}
["DEPARTAMENTO","CODIGO_DIVIPOLA_ENTIDAD","NOMBRE_ENTIDAD","SALDO"]
["ANTIOQUIA",5002,"ABEJORRAL",282.37299999999999]
["ANTIOQUIA",5004,"ABRIAQUÍ",1288.0440000000001]
["ANTIOQUIA",5021,"ALEJANDRÍA",0.82699999999999996]
["ANTIOQUIA",5030,"AMAGÁ",2652.5320000000002]
["ANTIOQUIA",5031,"AMALFI",4924.3109999999997]
["ANTIOQUIA",5036,"ANGELÓPOLIS",190.292]
["ANTIOQUIA",5040,"ANORÍ",815.12900000000002]
["ANTIOQUIA",5044,"ANZÁ",338.90300000000002]
["ANTIOQUIA",5045,"APARTADÓ",22656.046999999999]
{"$rows_left_out":672}
{"sheet":"Entidad","index":6,"n_rows":20,"n_cols":2,"rows_kept":20,"cut":false,"hidden":false,"merged":[[2,0,2,1],[4,0,5,2],[19,0,19,2]]}
[]
[]
[]
[]
["FORMULACION PLAN FINANCIERO DEL MARCO FISCAL DE MEDIANO PLAZO"]
[]
[]
["Departamento:",{"$f":"DatosBasicos!B2","v":"MAGDALENA"}]
[]
["Entidad Territorial:","CIÉNAGA"]
{"$rows_left_out":11}
{"sheet":"Descripción_Glosario","index":7,"n_rows":44,"n_cols":3,"rows_kept":44,"cut":false,"hidden":false,"merged":[[24,2,24,9],[25,2,25,9],[26,2,26,9],[21,2,21,9],[22,2,22,9],[23,2,23,9],[2,0,2,10],[8,1,8,10],[18,2,18,9],[19,2,19,9],[20,2,20,9],[10,1,10,10],[11,1,11,10],[12,1,12,10],[13,1,13,10],[14,1,14,10],[5,1,5,10],[7,1,7,10],[6,1,6,10],[9,1,9,10],[15,1,15,10],[32,2,32,9],[33,2,33,9],[34,2,34,9],[35,2,35,9],[36,2,36,9],[27,2,27,9],[28,2,28,9],[29,2,29,9],[30,2,30,9],[31,2,31,9],[42,2,42,9],[43,2,43,9],[37,2,37,9],[38,2,38,9],[39,2,39,9],[40,2,40,9],[41,2,41,9]]}
[]
[]
["Herramienta: Plan Financiero"]
[]
["1. Descripción Estructura de la Herramienta:"]
[null,"Hoja \"Histórico Deptos\" = Estructura del Plan Financiero formulado por el DNP que contiene la información de ingresos y gastos de las últimas cuatro (4) vigencias para el Departamento. Esta información permite evaluar las variaciones y composiciones y tomar estos datos como referencia para las proyecciones."]
[null,"Hoja \"Histórico Mpios\" = Estructura del Plan Financiero formulado por el DNP que contiene la información de ingresos y gastos de las últimas cuatro (4) vigencias para Municipios. Esta información permite evaluar las variaciones y composiciones y tomar estos datos como referencia para las proyecciones."]
[null,"Hoja \"Restricciones_Pptales_ET\" = Relación de las Restricciones Presupuestales de la Entidad Territorial, derivadas de la Ejecución de Programas de Saneamiento Fiscal, la aprobación de Vigencias Futuras, la existencia de pasivos ciertos y exigibles de vigencias anteriores y la determinación de los pasivos contingentes. Incluye la determinación de Ingresos Corrientes de Libre Destinación y límites del gasto."]
[null,"Hoja \"Ingresos\" = Contiene la información del Presupuesto Definitivo y los Recaudos de la Entidad Territorial, con corte al mes de Marzo de la vigencia, reportados a través del FUT.  La columna H de la hoja permite digitar, en cada una de las celdas resaltadas en amarillo, los valores proyectados de los recaudos que se obtendrán por cada concepto entre el mes de abril y diciembre de la vigencia. En la columna I se obtiene el total del ingreso proyectado para la vigencia. Finalmente, la columna J permite digitar, en cada una de las celdas resaltadas en amarillo, los valores del proyecto de presupuesto de ingresos para cada concepto en la siguiente vigencia."]
[null,"Hoja \"Gastos\" = Contiene la información del Presupuesto Definitivo y los Compromisos de la Entidad Territorial, con corte al mes de Marzo de la vigencia, reportados a través del FUT.  La columna E de la hoja permite digitar, en cada una de las celdas resaltadas en amarillo, los valores de los compromisos que se proyectan adquirir por cada concepto entre el mes de abril y diciembre de la vigencia. En la columna I se obtiene el total de los compromisos proyectados para la vigencia. Finalmente, la columna G permite digitar, en cada una de las celdas resaltadas en amarillo, los valores del proyecto de presupuesto de gastos para cada concepto en la siguiente vigencia."]
{"$rows_left_out":35}
{"sheet":"Supuestos Macro Nación","index":8,"n_rows":74,"n_cols":35,"rows_kept":74,"cut":false,"hidden":false,"merged":[]}
[null,null,"Fecha:",{"$f":"TODAY()","v":"2019-04-01"}]
["SUPUESTOS GENERALES BASICOS",null,null,null,1999,2000,2001,2002,2003,2004,2005,2006,2007,2008,2009,2010,2011,2012,2013,2014,2015,2016,2017,2018,2019,2020,2021,2022,2023,2024,2025,2026,2027,2028,2029]
[]
[]
[]
["INFLACION",null,null,null,null,null,null,null,null,null,null,null,null,1000]
[]
[null,"INFLACION DOMESTICA"]
[null,"   IPC fin de período",null,null,9.2316540745348128,8.7482000000000006,7.6483040097600652,6.9918404067033757,6.4913617953455738,5.4969828257933617,4.8551654166048674,4.4779483553561761,5.6944612269421713,7.6743713813311798,2.0018080000000049,3.1712222199041795,3.7266851825832337,2.44,1.94,3.66,6.77,5.75,4.09,3.3,3,3,3,3,3,3,3,3,3,3,3]
[null,"INFLACION EXTERNA"]
{"$rows_left_out":65}
{"sheet":"Plan Financiero","index":9,"n_rows":129,"n_cols":17,"rows_kept":129,"cut":false,"hidden":false,"merged":[[0,2,0,3],[1,2,1,3],[2,2,2,3]]}
[null,null,"BALANCE FINANCIERO DEPARTAMENTO"]
[null,null,{"$f":"+Entidad!B10","v":"CIÉNAGA"}]
[null,null,"Valores en millones de pesos"]
["Tipo","Categoria FUT","Cuenta","Descripción",{"$f":"VALUE(DatosBasicos!A2)-1","v":2017},{"$f":"DatosBasicos!A2","v":2018},{"$f":"+Entidad!B14+1","v":2019},{"$f":"+G4+1","v":2020},{"$f":"+H4+1","v":2021},2022,2023,2024,2025,2026,2027,2028,2029]
["P","NA","BF_1","INGRESOS TOTALES",{"$f":"E6+E75","v":163056.78300000002},{"$f":"F6+F75","v":0},{"$f":"G6+G75","v":143243.50700499999},147540.81221515001,151967.03658160451,156526.04767905263,161221.8291094242,166058.48398270697,171040.23850218818,176171.44565725382,181456.58902697149,186900.2866977806,{"$f":"Q6+Q75","v":192507.29529871399}]
["P","NA","BF_1.1","    INGRESOS CORRIENTES",{"$f":"E7+E20+E23","v":153562.69800000003},{"$f":"F7+F20+F23","v":0},{"$f":"G7+G20+G23","v":143243.50700499999},147540.81221515001,151967.03658160451,156526.04767905263,161221.8291094242,166058.48398270697,171040.23850218818,176171.44565725382,181456.58902697149,186900.2866977806,{"$f":"Q7+Q20+Q23","v":192507.29529871399}]
["P","NA","BF_1.1.1","        TRIBUTARIOS",{"$f":"SUM(E8:E19)","v":20585.578000000001},{"$f":"SUM(F8:F19)","v":0},{"$f":"SUM(G8:G19)","v":16347},16837.410000000003,17342.532300000003,17862.808269000001,18398.692517070001,18950.653292582105,19519.172891359565,20104.748078100354,20707.890520443365,21329.127236056665,{"$f":"SUM(Q8:Q19)","v":21969.001053138367}]
["H","INGRESOS","BF_1.1.1.1","             Vehículos Automotores",{"$f":"IFERROR(VLOOKUP(Entidad!$B$12&\"-\"&'Plan Financiero'!$C8,DAF_BalanceFinancieroVA!$A$2:$H$2164,8,FALSE),0)","v":0},null,0,{"$f":"+G8*1.03","v":0},{"$f":"+H8*1.03","v":0},0,0,0,0,0,0,0,0]
["H","INGRESOS","BF_1.1.1.2","             Impuesto Predial Unificado",{"$f":"IFERROR(VLOOKUP(Entidad!$B$12&\"-\"&'Plan Financiero'!$C9,DAF_BalanceFinancieroVA!$A$2:$H$2164,8,FALSE),0)","v":1369.3019999999999},null,1759,{"$f":"+G9*1.03","v":1811.77},{"$f":"+H9*1.03","v":1866.1231},1922.1067930000002,1979.7699967900003,2039.1630966937003,2100.3379895945113,2163.3481292823467,2228.2485731608172,2295.0960303556417,2363.9489112663109]
["H","INGRESOS","BF_1.1.1.3","             Impuesto de Industria y Comercio",{"$f":"IFERROR(VLOOKUP(Entidad!$B$12&\"-\"&'Plan Financiero'!$C10,DAF_BalanceFinancieroVA!$A$2:$H$2164,8,FALSE),0)","v":8676.5380000000005},null,9637,{"$f":"+G10*1.03","v":9926.11},10223.893300000002,10530.610099000001,10846.528401970001,11171.924254029102,11507.081981649975,11852.294441099475,12207.86327433246,12574.099172562434,12951.322147739307]
{"$rows_left_out":120}
{"sheet":"Superávit Primario","index":10,"n_rows":15,"n_cols":14,"rows_kept":15,"cut":false,"hidden":false,"merged":[]}
[{"$f":"Entidad!B10","v":"CIÉNAGA"}]
["METAS DEL SUPERAVIT PRIMARIO"]
["LEY 819 DE 2003 (millones de pesos)"]
["CONCEPTOS",{"$f":"+'Plan Financiero'!E4","v":2017},{"$f":"+'Plan Financiero'!F4","v":2018},{"$f":"+'Plan Financiero'!G4","v":2019},{"$f":"+'Plan Financiero'!H4","v":2020},{"$f":"+'Plan Financiero'!I4","v":2021},{"$f":"+'Plan Financiero'!J4","v":2022},{"$f":"+'Plan Financiero'!K4","v":2023},{"$f":"+'Plan Financiero'!L4","v":2024},{"$f":"+'Plan Financiero'!M4","v":2025},{"$f":"+'Plan Financiero'!N4","v":2026},{"$f":"+'Plan Financiero'!O4","v":2027},{"$f":"+'Plan Financiero'!P4","v":2028},{"$f":"+'Plan Financiero'!Q4","v":2029}]
["INGRESOS CORRIENTES",{"$f":"+'Plan Financiero'!E6","v":153562.69800000003},{"$f":"+'Plan Financiero'!F6","v":0},{"$f":"+'Plan Financiero'!G6","v":143243.50700499999},{"$f":"+'Plan Financiero'!H6","v":147540.81221515001},{"$f":"+'Plan Financiero'!I6","v":151967.03658160451},{"$f":"+'Plan Financiero'!J6","v":156526.04767905263},{"$f":"+'Plan Financiero'!K6","v":161221.8291094242},{"$f":"+'Plan Financiero'!L6","v":166058.48398270697},{"$f":"+'Plan Financiero'!M6","v":171040.23850218818},{"$f":"+'Plan Financiero'!N6","v":176171.44565725382},{"$f":"+'Plan Financiero'!O6","v":181456.58902697149},{"$f":"+'Plan Financiero'!P6","v":186900.2866977806},{"$f":"+'Plan Financiero'!Q6","v":192507.29529871399}]
["RECURSOS DE CAPITAL",{"$f":"+'Plan Financiero'!E75+'Plan Financiero'!E106","v":21567.353999999999},{"$f":"+'Plan Financiero'!F75+'Plan Financiero'!F106","v":0},{"$f":"+'Plan Financiero'!G75+'Plan Financiero'!G106","v":0},{"$f":"+'Plan Financiero'!H75+'Plan Financiero'!H106","v":0},{"$f":"+'Plan Financiero'!I75+'Plan Financiero'!I106","v":0},{"$f":"+'Plan Financiero'!J75+'Plan Financiero'!J106","v":0},{"$f":"+'Plan Financiero'!K75+'Plan Financiero'!K106","v":0},{"$f":"+'Plan Financiero'!L75+'Plan Financiero'!L106","v":0},{"$f":"+'Plan Financiero'!M75+'Plan Financiero'!M106","v":0},{"$f":"+'Plan Financiero'!N75+'Plan Financiero'!N106","v":0},{"$f":"+'Plan Financiero'!O75+'Plan Financiero'!O106","v":0},{"$f":"+'Plan Financiero'!P75+'Plan Financiero'!P106","v":0},{"$f":"+'Plan Financiero'!Q75+'Plan Financiero'!Q106","v":0}]
["GASTOS DE FUNCIONAMIENTO",{"$f":"+'Plan Financiero'!E49","v":14073.749},{"$f":"+'Plan Financiero'!F49","v":0},{"$f":"+'Plan Financiero'!G49","v":11514.587680000001},{"$f":"+'Plan Financiero'!H49","v":12021.22953792},{"$f":"+'Plan Financiero'!I49","v":12550.163637588481},{"$f":"+'Plan Financiero'!J49","v":13102.370837642375},{"$f":"+'Plan Financiero'!K49","v":13678.875154498641},{"$f":"+'Plan Financiero'!L49","v":14280.745661296582},{"$f":"+'Plan Financiero'!M49","v":14909.09847039363},{"$f":"+'Plan Financiero'!N49","v":15565.09880309095},{"$f":"+'Plan Financiero'!O49","v":16249.963150426953},{"$f":"+'Plan Financiero'!P49","v":16964.961529045737},{"$f":"+'Plan Financiero'!Q49","v":17711.419836323752}]
["GASTOS DE INVERSION",{"$f":"+'Plan Financiero'!E65+'Plan Financiero'!E87+SUM('Plan Financiero'!E63:E64)","v":152303.049},{"$f":"+'Plan Financiero'!F65+'Plan Financiero'!F87+SUM('Plan Financiero'!F63:F64)","v":0},{"$f":"+'Plan Financiero'!G65+'Plan Financiero'!G87+SUM('Plan Financiero'!G63:G64)","v":130849.20077005381},{"$f":"+'Plan Financiero'!H65+'Plan Financiero'!H87+SUM('Plan Financiero'!H63:H64)","v":134662.67531492811},{"$f":"+'Plan Financiero'!I65+'Plan Financiero'!I87+SUM('Plan Financiero'!I63:I64)","v":138582.77677401601},{"$f":"+'Plan Financiero'!J65+'Plan Financiero'!J87+SUM('Plan Financiero'!J63:J64)","v":142612.39186441025},{"$f":"+'Plan Financiero'!K65+'Plan Financiero'!K87+SUM('Plan Financiero'!K63:K64)","v":146754.48017092556},{"$f":"+'Plan Financiero'!L65+'Plan Financiero'!L87+SUM('Plan Financiero'!L63:L64)","v":151012.07572941037},{"$f":"+'Plan Financiero'!M65+'Plan Financiero'!M87+SUM('Plan Financiero'!M63:M64)","v":155756.86293279455},{"$f":"+'Plan Financiero'!N65+'Plan Financiero'!N87+SUM('Plan Financiero'!N63:N64)","v":160606.34685416287},{"$f":"+'Plan Financiero'!O65+'Plan Financiero'!O87+SUM('Plan Financiero'!O63:O64)","v":165206.62587654454},{"$f":"+'Plan Financiero'!P65+'Plan Financiero'!P87+SUM('Plan Financiero'!P63:P64)","v":169935.32516873485},{"$f":"+'Plan Financiero'!Q65+'Plan Financiero'!Q87+SUM('Plan Financiero'!Q63:Q64)","v":174795.87546239022}]
["SUPERAVIT O DEFICIT PRIMARIO",{"$f":"+B5+B6-B7-B8","v":8753.2540000000154},0,{"$f":"+D5+D6-D7-D8","v":879.71855494618649},856.90736230189214,834.09617000003345,811.28497700000298,788.47378400000161,765.66259200000786,374.277098999999,0,0,0,{"$f":"+N5+N6-N7-N8","v":0}]
["INDICADOR (superavit primario / Intereses) > = 100%",{"$f":"IF(B14<>0,B9/(B14),IF(AND(B14=0,B9<0),0,0))","v":12.670193702287335},{"$f":"IF(C14<>0,C9/(C14),IF(AND(C14=0,C9<0),0,0))","v":0},6.2963616771233903,7.3297981019277643,8.8642945828723256,11.38086888910693,16.265983773827138,29.835746599564374,87.507233056798313,0,0,0,{"$f":"IF(N14<>0,N9/(N14),IF(AND(N14=0,N9<0),0,0))","v":0}]
{"$rows_left_out":6}
{"sheet":"Capacidad de Endeudamiento","index":11,"n_rows":52,"n_cols":14,"rows_kept":52,"cut":false,"hidden":false,"merged":[[0,1,0,2],[1,1,1,2],[2,1,2,2],[2,3,2,13]]}
[null,"REFERENTE DE LA CAPACIDAD DE ENDEUDAMIENTO",null,"IPC PROYECTADO"]
[null,{"$f":"Entidad!B10","v":"CIÉNAGA"},null,{"$f":"+'Supuestos Macro Nación'!Y9/100","v":0.03},{"$f":"+'Supuestos Macro Nación'!Z9/100","v":0.03},{"$f":"+'Supuestos Macro Nación'!AA9/100","v":0.03},{"$f":"+'Supuestos Macro Nación'!AB9/100","v":0.03},{"$f":"+'Supuestos Macro Nación'!AC9/100","v":0.03},{"$f":"+'Supuestos Macro Nación'!AD9/100","v":0.03},{"$f":"+'Supuestos Macro Nación'!AE9/100","v":0.03},{"$f":"+'Supuestos Macro Nación'!AF9/100","v":0.03},{"$f":"+'Supuestos Macro Nación'!AG9/100","v":0.03},{"$f":"+'Supuestos Macro Nación'!AH9/100","v":0.03},{"$f":"+'Supuestos Macro Nación'!AI9/100","v":0.03}]
[null,"Valores en millones de pesos",null,"PROYECCION CAPACIDAD LEGAL DE ENDEUDAMIENTO - LEY 358 DE 1997"]
[null,"Concepto",{"$f":"\"Capacidad de endeudamiento (Ley 358/97)       \"&Entidad!B14","v":"Capacidad de endeudamiento (Ley 358/97)       2018"},{"$f":"+Entidad!B14+1","v":2019},{"$f":"+D4+1","v":2020},{"$f":"+E4+1","v":2021},2022,2023,2024,2025,2026,2027,2028,2029]
[null,"1. Ingresos corrientes Ley 358 de 1997 (1.1-1.2)",{"$f":"C6-C7","v":44150.887096999999},{"$f":"D6-D7","v":43880.979945910003},45197.409344287305,46553.331624615923,47949.931573354406,49388.429520555037,50870.082406171685,52396.184878356835,53968.070424707548,55587.112537448767,57254.725913572234,{"$f":"N6-N7","v":58972.367690979401}]
["CAPEN.1.1","    1.1 Ingresos corrientes (sin descontar vigencias futuras)",{"$f":"IFERROR(VLOOKUP(Entidad!$B$12&\"-\"&'Capacidad de Endeudamiento'!$A6,DAF_Ley358!$A$2:$G$120,7,FALSE),0)","v":47195.596097000001},{"$f":"+C6*(1+D2)","v":48611.463979910004},{"$f":"+D6*(1+E2)","v":50069.807899307307},51571.902136286524,53119.059200375123,54712.630976386376,56354.009905677965,58044.630202848304,59785.969108933758,61579.548182201768,63426.934627667826,65329.742666497863]
["CAPEN.1.2","    1.2 Vigencias futuras",{"$f":"IFERROR(VLOOKUP(Entidad!$B$12&\"-\"&'Capacidad de Endeudamiento'!$A7,DAF_Ley358!$A$2:$G$120,7,FALSE),0)","v":3044.7089999999998},4730.4840340000001,4872.3985550200005,5018.5705116706004,5169.1276270207181,5324.2014558313394,5483.9274995062797,5648.4453244914685,5817.8986842262129,5992.4356447529999,6172.20871409559,6357.3749755184581]
["CAPEN.2","2. Gastos de funcionamiento",{"$f":"IFERROR(VLOOKUP(Entidad!$B$12&\"-\"&'Capacidad de Endeudamiento'!$A8,DAF_Ley358!$A$2:$G$120,7,FALSE),0)","v":13996.105904},{"$f":"+C8*(1+D2)","v":14415.98908112},{"$f":"+D8*(1+E2)","v":14848.468753553601},15293.92281616021,15752.740500645015,16225.322715664366,16712.082397134298,17213.444869048326,17729.848215119775,18261.743661573368,18809.595971420571,19373.88385056319]
[null,"3. Ahorro operacional (1-2)",{"$f":"C5-C8","v":30154.781192999999},{"$f":"D5-D8","v":29464.990864790001},30348.940590733706,31259.408808455715,32197.191072709393,33163.106804890675,34158.000009037387,35182.740009308509,36238.222209587773,37325.3688758754,38445.12994215166,{"$f":"N5-N8","v":39598.483840416215}]
[null,"4. Saldo neto de la deuda con nuevo crédito (4.1-4.2-4.3+4.4)",{"$f":"C11-C16-C20+C21","v":4850.3606250000003},4110.3606250000003,3370.3606250000003,2630.3606250000003,1890.3606250000003,1150.3606250000003,410.36062500000025,40.360625000000255,40.360625000000255,40.360625000000255,40.360625000000255,{"$f":"N11-N16-N20+N21","v":40.360625000000255}]
{"$rows_left_out":42}